Target
Lanosterol synthase
Ligand
BDBM50128065
Substrate
Meas. Tech.
ChEMBL_515552 (CHEMBL1036573)
IC50
170±n/a nM
Citation
 Balliano, GDehmlow, HOliaro-Bosso, SScaldaferri, MTaramino, SViola, FCaron, GAebi, JAckermann, J Oxidosqualene cyclase from Saccharomyces cerevisiae, Trypanosoma cruzi, Pneumocystis carinii and Arabidopsis thaliana expressed in yeast: a model for the development of novel antiparasitic agents. Bioorg Med Chem Lett 19:718-23 (2009)  
Target
Name:
Lanosterol synthase
Synonyms:
2,3-epoxysqualene--lanosterol cyclase LSS_HUMAN Oxidosqualene--lanosterol cyclase
Type:
PROTEIN
Mol. Mass.:
83309.32
Organism:
Homo sapiens (Human)
Description:
ChEMBL_11231
Residue:
732
  
Inhibitor
Name:
BDBM50128065
Synonyms:
CHEMBL304858 N-allyl-6-(4-(4-bromobenzoyl)-3-fluorophenoxy)-N-methylhexan-1-aminium {4-[6-(Allyl-methyl-amino)-hexyloxy]-2-fluoro-phenyl}-(4-bromo-phenyl)-methanone
Type:
Small organic molecule
Emp. Form.:
C23H27BrFNO2
Mol. Mass.:
448.368
SMILES:
CN(CCCCCCOc1ccc(C(=O)c2ccc(Br)cc2)c(F)c1)CC=C
: