Target
Carbonic anhydrase 4
Ligand
BDBM26997
Substrate
Meas. Tech.
ChEMBL_515684 (CHEMBL993072)
Ki
13900000±n/a nM
Citation
 Bertucci, AInnocenti, AZoccola, DScozzafava, AAllemand, DTambutté, SSupuran, CT Carbonic anhydrase inhibitors: inhibition studies of a coral secretory isoform with inorganic anions. Bioorg Med Chem Lett 19:650-3 (2009)  
Target
Name:
Carbonic anhydrase 4
Synonyms:
CA-IV CAH4_HUMAN Carbonic anhydrase Carbonic anhydrase IV (CA IV)
Type:
Enzyme
Mol. Mass.:
35037.98
Organism:
Homo sapiens (Human)
Description:
P22748
Residue:
312
  
Inhibitor
Name:
BDBM26997
Synonyms:
CHEMBL364571 benzenarsonic acid phenylarsonic acid
Type:
Emp. Form.:
C6H7AsO3
Mol. Mass.:
202.0396
SMILES:
O[As](O)(=O)c1ccccc1
: