Target
Aldo-keto reductase family 1 member A1
Ligand
BDBM50038843
Substrate
Meas. Tech.
ChEMBL_515733 (CHEMBL1023735)
IC50
40±n/a nM
Citation
 Carbone, VZhao, HTChung, REndo, SHara, AEl-Kabbani, O Correlation of binding constants and molecular modelling of inhibitors in the active sites of aldose reductase and aldehyde reductase. Bioorg Med Chem 17:1244-50 (2009)  
Target
Name:
Aldo-keto reductase family 1 member A1
Synonyms:
AK1A1_PIG ALR Aldehyde reductase
Type:
PROTEIN
Mol. Mass.:
36557.09
Organism:
Sus scrofa
Description:
ChEMBL_615076
Residue:
325
  
Inhibitor
Name:
BDBM50038843
Synonyms:
(4R)-2-(4-bromo-2-fluorobenzyl)-6-fluoro-1H,2'H,5'H-spiro[isoquinoline-4,3'-pyrrolidine]-1,2',3,5'(2H)-tetrone 2-(4-bromo-2-fluorobenzyl)-6-fluoro-1H,2'H,5'H-spiro[isoquinoline-4,3'-pyrrolidine]-1,2',3,5'(2H)-tetrone 2[4-BROMO-2-FLUOROPHENYL)METHYL]-6-FLUOROSPIRO[ISOQUINOLINE-4-(1H),3'-PYRROLIDINE]-1,2',3,5'(2H)-TETRONE minalrestat
Type:
Small organic molecule
Emp. Form.:
C19H11BrF2N2O4
Mol. Mass.:
449.202
SMILES:
Fc1ccc2C(=O)N(Cc3ccc(Br)cc3F)C(=O)[C@]3(CC(=O)NC3=O)c2c1
: