Target
Vascular endothelial growth factor receptor 1
Ligand
BDBM50277281
Substrate
Meas. Tech.
ChEMBL_540571 (CHEMBL1034023)
IC50
170±n/a nM
Citation
 Kiselyov, ASSemenova, MSemenov, VV 3,4-Disubstituted isothiazoles: novel potent inhibitors of VEGF receptors 1 and 2. Bioorg Med Chem Lett 19:1195-8 (2009)  
Target
Name:
Vascular endothelial growth factor receptor 1
Synonyms:
FLT FRT Fms-like tyrosine kinase 1 Tyrosine-protein kinase FRT VEGFR-1 VGFR1_HUMAN Vascular endothelial growth factor receptor 1 (FLT1) Vascular endothelial growth factor receptor 1 and 2 (Flt-1 and KDR) Vascular permeability factor receptor vascular endothelial growth factor/vascular permeability factor receptor
Type:
Receptor Tyrosine Kinase
Mol. Mass.:
150800.23
Organism:
Homo sapiens (Human)
Description:
P17948
Residue:
1338
  
Inhibitor
Name:
BDBM50277281
Synonyms:
4-(pyridin-4-ylmethylamino)-N-(3-(trifluoromethyl)phenyl)isothiazole-3-carboxamide | CHEMBL515880
Type:
Small organic molecule
Emp. Form.:
C17H13F3N4OS
Mol. Mass.:
378.372
SMILES:
FC(F)(F)c1cccc(NC(=O)c2nscc2NCc2ccncc2)c1
: