Target
Vascular endothelial growth factor receptor 2
Ligand
BDBM50277321
Substrate
Meas. Tech.
ChEMBL_540574 (CHEMBL1034026)
IC50
>10000±n/a nM
Citation
 Kiselyov, ASSemenova, MSemenov, VV 3,4-Disubstituted isothiazoles: novel potent inhibitors of VEGF receptors 1 and 2. Bioorg Med Chem Lett 19:1195-8 (2009)  
Target
Name:
Vascular endothelial growth factor receptor 2
Synonyms:
CD_antigen=CD309 Fetal liver kinase 1 (FLK-1) KDR Protein-tyrosine kinase receptor Flk-1 VEGFR-2 VEGFR2 Vascular Endothelial Growth Factor Receptor Kinase 2 Vascular endothelial growth factor receptor 2 (KDR) Vascular endothelial growth factor receptor 2 (VEGFR2) Vascular endothelial growth factor receptor-2 (VEGFR-2)
Type:
Receptor Tyrosine Kinase
Mol. Mass.:
151510.97
Organism:
Homo sapiens (Human)
Description:
P35968
Residue:
1356
  
Inhibitor
Name:
BDBM50277321
Synonyms:
4-(pyridin-3-ylmethylamino)-N-(4-(trifluoromethyl)phenyl)isothiazole-3-carboxamide | CHEMBL474293
Type:
Small organic molecule
Emp. Form.:
C17H13F3N4OS
Mol. Mass.:
378.372
SMILES:
FC(F)(F)c1ccc(NC(=O)c2nscc2NCc2cccnc2)cc1
: