Target
Vascular endothelial growth factor receptor 2
Ligand
BDBM50276966
Substrate
Meas. Tech.
ChEMBL_540570 (CHEMBL1034022)
IC50
>10000±n/a nM
Citation
 Kiselyov, ASSemenova, MSemenov, VV 3,4-Disubstituted isothiazoles: novel potent inhibitors of VEGF receptors 1 and 2. Bioorg Med Chem Lett 19:1195-8 (2009)  
Target
Name:
Vascular endothelial growth factor receptor 2
Synonyms:
CD_antigen=CD309 Fetal liver kinase 1 (FLK-1) KDR Protein-tyrosine kinase receptor Flk-1 VEGFR-2 VEGFR2 Vascular Endothelial Growth Factor Receptor Kinase 2 Vascular endothelial growth factor receptor 2 (KDR) Vascular endothelial growth factor receptor 2 (VEGFR2) Vascular endothelial growth factor receptor-2 (VEGFR-2)
Type:
Receptor Tyrosine Kinase
Mol. Mass.:
151510.97
Organism:
Homo sapiens (Human)
Description:
P35968
Residue:
1356
  
Inhibitor
Name:
BDBM50276966
Synonyms:
4-(2-(benzo[d][1,3]dioxol-5-yl)ethylamino)-N-(3-(trifluoromethyl)phenyl)isothiazole-3-carboxamide | CHEMBL462527
Type:
Small organic molecule
Emp. Form.:
C20H16F3N3O3S
Mol. Mass.:
435.42
SMILES:
FC(F)(F)c1cccc(NC(=O)c2nscc2NCCc2ccc3OCOc3c2)c1
: