Target
Ribokinase
Ligand
BDBM50255785
Substrate
Meas. Tech.
ChEMBL_515843 (CHEMBL1030542)
IC50
>300000±n/a nM
Citation
 Desroy, NMoreau, FBriet, SLe Fralliec, GFloquet, SDurant, LVongsouthi, VGerusz, VDenis, AEscaich, S Towards Gram-negative antivirulence drugs: new inhibitors of HldE kinase. Bioorg Med Chem 17:1276-89 (2009)  
Target
Name:
Ribokinase
Synonyms:
RBSK_ECOLI | rbsK
Type:
PROTEIN
Mol. Mass.:
32281.04
Organism:
Escherichia coli (strain K12)
Description:
ChEMBL_515843
Residue:
309
  
Inhibitor
Name:
BDBM50255785
Synonyms:
((1,3-Benzothiazol-2-ylmethyl){[4-methyl-2-(3-nitrophenyl)-1,3-thiazol-5-yl]carbonyl}amino)acetic acid | CHEMBL518604
Type:
Small organic molecule
Emp. Form.:
C21H16N4O5S2
Mol. Mass.:
468.506
SMILES:
Cc1nc(sc1C(=O)N(CC(O)=O)Cc1nc2ccccc2s1)-c1cccc(c1)[N+]([O-])=O
: