Target
Procathepsin L
Ligand
BDBM50255410
Substrate
Meas. Tech.
ChEMBL_515846 (CHEMBL1030545)
Ki
14000±n/a nM
Citation
 Ayesa, SLindquist, CAgback, TBenkestock, KClasson, BHenderson, IHewitt, EJansson, KKallin, ASheppard, DSamuelsson, B Solid-phase parallel synthesis and SAR of 4-amidofuran-3-one inhibitors of cathepsin S: effect of sulfonamides P3 substituents on potency and selectivity. Bioorg Med Chem 17:1307-24 (2009)  
Target
Name:
Procathepsin L
Synonyms:
CATL1_HUMAN CTSL CTSL1 Cathepsin L Cathepsin L1 heavy chain MEP cathepsin L preproprotein
Type:
Enzyme
Mol. Mass.:
37557.19
Organism:
Homo sapiens (Human)
Description:
Purchased from Calbiochem (San Diego, CA).
Residue:
333
  
Inhibitor
Name:
BDBM50255410
Synonyms:
CHEMBL519763 | N-[1-(2S-Ethyl-4-oxo-tetrahydro-furan-3S-ylcarbamoyl)-2S-(1-methyl-cyclopentyl)-ethyl]-6-methanesulfonylaminonicotinamide
Type:
Small organic molecule
Emp. Form.:
C22H32N4O6S
Mol. Mass.:
480.578
SMILES:
CC[C@@H]1OCC(=O)[C@H]1NC(=O)[C@H](CC1(C)CCCC1)NC(=O)c1ccc(NS(C)(=O)=O)nc1
: