Target
Cathepsin K
Ligand
BDBM50255176
Substrate
Meas. Tech.
ChEMBL_515845 (CHEMBL1030544)
Ki
1700±n/a nM
Citation
 Ayesa, SLindquist, CAgback, TBenkestock, KClasson, BHenderson, IHewitt, EJansson, KKallin, ASheppard, DSamuelsson, B Solid-phase parallel synthesis and SAR of 4-amidofuran-3-one inhibitors of cathepsin S: effect of sulfonamides P3 substituents on potency and selectivity. Bioorg Med Chem 17:1307-24 (2009)  
Target
Name:
Cathepsin K
Synonyms:
CATK_HUMAN CTSO Cathepsin O Cathepsin X
Type:
Enzyme
Mol. Mass.:
36975.68
Organism:
Homo sapiens (Human)
Description:
P43235
Residue:
329
  
Inhibitor
Name:
BDBM50255176
Synonyms:
CHEMBL475062 | N-[1-(2S-Ethyl-4-oxo-tetrahydro-furan-3S-ylcarbamoyl)-2S-(1-methyl-cyclopentyl)-ethyl]-4-phenylmethanesulfonylamino-benzamide
Type:
Small organic molecule
Emp. Form.:
C29H37N3O6S
Mol. Mass.:
555.686
SMILES:
CC[C@@H]1OCC(=O)[C@H]1NC(=O)[C@H](CC1(C)CCCC1)NC(=O)c1ccc(NS(=O)(=O)Cc2ccccc2)cc1
: