Target
D(4) dopamine receptor
Ligand
BDBM50277037
Substrate
Meas. Tech.
ChEMBL_541031 (CHEMBL1024731)
Ki
1015±n/a nM
Citation
 Sikazwe, DMNkansah, NTAltundas, RZhu, XYRoth, BLSetola, VAblordeppey, SY Synthesis and evaluation of ligands for D2-like receptors: the role of common pharmacophoric groups. Bioorg Med Chem 17:1716-23 (2009)  
Target
Name:
D(4) dopamine receptor
Synonyms:
D(2C) dopamine receptor DOPAMINE D4.2 DRD4 Dopamine D4 receptor
Type:
Enzyme
Mol. Mass.:
48373.19
Organism:
Homo sapiens (Human)
Description:
P21917
Residue:
419
  
Inhibitor
Name:
BDBM50277037
Synonyms:
3-(4-Chlorophenyl)-8-(4-fluorobenzyl)-8-azabicyclo[3.2.1]octan-3-ol | CHEMBL456430
Type:
Small organic molecule
Emp. Form.:
C20H21ClFNO
Mol. Mass.:
345.838
SMILES:
OC1(CC2CCC(C1)N2Cc1ccc(F)cc1)c1ccc(Cl)cc1
: