Target
D(4) dopamine receptor
Ligand
BDBM50277039
Substrate
Meas. Tech.
ChEMBL_541031 (CHEMBL1024731)
Ki
583.7±n/a nM
Citation
 Sikazwe, DMNkansah, NTAltundas, RZhu, XYRoth, BLSetola, VAblordeppey, SY Synthesis and evaluation of ligands for D2-like receptors: the role of common pharmacophoric groups. Bioorg Med Chem 17:1716-23 (2009)  
Target
Name:
D(4) dopamine receptor
Synonyms:
D(2C) dopamine receptor DOPAMINE D4.2 DRD4 Dopamine D4 receptor
Type:
Enzyme
Mol. Mass.:
48373.19
Organism:
Homo sapiens (Human)
Description:
P21917
Residue:
419
  
Inhibitor
Name:
BDBM50277039
Synonyms:
9-[(1H-pyrrolo[2,3-b]pyridin-3-yl)methyl]-3-(4-chlorophenyl)-3,9-diazabicyclo[4.2.1]nonane | CHEMBL458342
Type:
Small organic molecule
Emp. Form.:
C21H23ClN4
Mol. Mass.:
366.887
SMILES:
Clc1ccc(cc1)N1CCC2CCC(C1)N2Cc1c[nH]c2ncccc12
: