Target
D(4) dopamine receptor
Ligand
BDBM50276975
Substrate
Meas. Tech.
ChEMBL_541031 (CHEMBL1024731)
Ki
56±n/a nM
Citation
 Sikazwe, DMNkansah, NTAltundas, RZhu, XYRoth, BLSetola, VAblordeppey, SY Synthesis and evaluation of ligands for D2-like receptors: the role of common pharmacophoric groups. Bioorg Med Chem 17:1716-23 (2009)  
Target
Name:
D(4) dopamine receptor
Synonyms:
D(2C) dopamine receptor DOPAMINE D4.2 DRD4 Dopamine D4 receptor
Type:
Enzyme
Mol. Mass.:
48373.19
Organism:
Homo sapiens (Human)
Description:
P21917
Residue:
419
  
Inhibitor
Name:
BDBM50276975
Synonyms:
3-{(4-(Pyrimidin-2-yl)piperazin-1-yl)methyl}-1H-pyrrolo[2,3-b]pyridine | CHEMBL460644
Type:
Small organic molecule
Emp. Form.:
C16H18N6
Mol. Mass.:
294.3543
SMILES:
C(N1CCN(CC1)c1ncccn1)c1c[nH]c2ncccc12
: