Target
Sterol O-acyltransferase 1
Ligand
BDBM50069900
Substrate
Meas. Tech.
ChEMBL_540911 (CHEMBL1027336)
IC50
479±n/a nM
Citation
 Asano, SBan, HKino, KIoriya, KMuraoka, M Novel 1,4-diarylpiperidine-4-methylureas as anti-hyperlipidemic agents: dual effectors on acyl-CoA:cholesterol O-acyltransferase and low-density lipoprotein receptor expression. Bioorg Med Chem Lett 19:1062-5 (2009)  
Target
Name:
Sterol O-acyltransferase 1
Synonyms:
ACACT ACAT Acetyl-CoA acetyltransferase, mitochondrial Acyl-CoA: cholesterol acyltransferase (ACAT) Cholesterol acyltransferase 1 SOAT1 STAT
Type:
Multi-pass membrane protein may form homo- or heterodimers.
Mol. Mass.:
64751.94
Organism:
Homo sapiens (Human)
Description:
P35610
Residue:
550
  
Inhibitor
Name:
BDBM50069900
Synonyms:
2,6-diisopropylphenyl 2-(2,4,6-triisopropylphenyl)acetylsulfamate CHEMBL101309 [2-(2,4,6-Triisopropyl-phenyl)-acetyl]-sulfamic acid 2,6-diisopropyl-phenyl ester
Type:
Small organic molecule
Emp. Form.:
C29H43NO4S
Mol. Mass.:
501.721
SMILES:
CC(C)c1cc(C(C)C)c(CC(=O)NS(=O)(=O)Oc2c(cccc2C(C)C)C(C)C)c(c1)C(C)C
: