Target
Sodium- and chloride-dependent taurine transporter
Ligand
BDBM50248665
Substrate
Meas. Tech.
ChEMBL_542994 (CHEMBL1018610)
IC50
>30000±n/a nM
Citation
 Zhao, ZLeister, WHO'Brien, JALemaire, WWilliams, DLJacobson, MASur, CKinney, GGPettibone, DJTiller, PRSmith, SHartman, GDLindsley, CWWolkenberg, SE Discovery of N-{[1-(propylsulfonyl)-4-pyridin-2-ylpiperidin-4-yl]methyl}benzamides as novel, selective and potent GlyT1 inhibitors. Bioorg Med Chem Lett 19:1488-91 (2009)  
Target
Name:
Sodium- and chloride-dependent taurine transporter
Synonyms:
SC6A6_HUMAN | SLC6A6
Type:
PROTEIN
Mol. Mass.:
69833.28
Organism:
Homo sapiens (Human)
Description:
ChEMBL_543463
Residue:
620
  
Inhibitor
Name:
BDBM50248665
Synonyms:
CHEMBL517034 | N-((1-(propylsulfonyl)-4-(pyridin-2-yl)piperidin-4-yl)methyl)-2-(trifluoromethoxy)benzamide
Type:
Small organic molecule
Emp. Form.:
C22H26F3N3O4S
Mol. Mass.:
485.52
SMILES:
CCCS(=O)(=O)N1CCC(CNC(=O)c2ccccc2OC(F)(F)F)(CC1)c1ccccn1
: