Target
Histone deacetylase 1
Ligand
BDBM50248570
Substrate
Meas. Tech.
ChEMBL_543051 (CHEMBL1021292)
IC50
41±n/a nM
Citation
 Wang, HYu, NSong, HChen, DZou, YDeng, WLye, PLChang, JNg, MSun, ETSangthongpitag, KWang, XWu, XKhng, HHFang, LGoh, SKOng, WCBonday, ZStünkel, WPoulsen, AEntzeroth, M N-Hydroxy-1,2-disubstituted-1H-benzimidazol-5-yl acrylamides as novel histone deacetylase inhibitors: design, synthesis, SAR studies, and in vivo antitumor activity. Bioorg Med Chem Lett 19:1403-8 (2009)  
Target
Name:
Histone deacetylase 1
Synonyms:
Cereblon/Histone deacetylase 1 HDAC1 Histone deacetylase 1 (HDAC1) RPD3L1
Type:
Enzyme
Mol. Mass.:
55090.27
Organism:
Homo sapiens (Human)
Description:
Q13547
Residue:
482
  
Inhibitor
Name:
BDBM50248570
Synonyms:
3-(1-(3-(dimethylamino)-2,2-dimethylpropyl)-2-phenethyl-1H-benzo[d]imidazol-5-yl)-N-hydroxyacrylamide US10201527, Compound 17 US8551988, 17
Type:
Small organic molecule
Emp. Form.:
C25H32N4O2
Mol. Mass.:
420.5472
SMILES:
CN(C)CC(C)(C)Cn1c(CCc2ccccc2)nc2cc(\C=C\C(=O)NO)ccc12
: