Target
Potassium voltage-gated channel subfamily H member 2
Ligand
BDBM50279453
Substrate
Meas. Tech.
ChEMBL_545264 (CHEMBL1020710)
IC50
4340±n/a nM
Citation
 Du, LLi, MYang, QTang, YYou, QXia, L Molecular hybridization, synthesis, and biological evaluation of novel chroman I(Kr) and I(Ks) dual blockers. Bioorg Med Chem Lett 19:1477-80 (2009)  
Target
Name:
Potassium voltage-gated channel subfamily H member 2
Synonyms:
ERG KCNH2_CAVPO
Type:
PROTEIN
Mol. Mass.:
18377.97
Organism:
Cavia porcellus
Description:
ChEMBL_545264
Residue:
162
  
Inhibitor
Name:
BDBM50279453
Synonyms:
1-(6-ethoxy-2,3-dihydrochromen-4-ylideneamino)-3-(3-(4-methylpiperazin-1-yl)propyl)imidazolidine-2,4-dione | CHEMBL487756
Type:
Small organic molecule
Emp. Form.:
C22H31N5O4
Mol. Mass.:
429.5126
SMILES:
CCOc1ccc2OCCC(=Nn3cc(O)n(CCCN4CCN(C)CC4)c3=O)c2c1
: