Target
3-oxoacyl-[acyl-carrier-protein] synthase 3
Ligand
BDBM50276635
Substrate
Meas. Tech.
ChEMBL_541154 (CHEMBL1030715)
Kd
>1000000±n/a nM
Citation
 Lee, JYJeong, KWLee, JUKang, DIKim, Y Novel E. coli beta-ketoacyl-acyl carrier protein synthase III inhibitors as targeted antibiotics. Bioorg Med Chem 17:1506-13 (2009)  
Target
Name:
3-oxoacyl-[acyl-carrier-protein] synthase 3
Synonyms:
3-oxoacyl-[acyl-carrier-protein] synthase 3-oxoacyl-[acyl-carrier-protein] synthase III | Beta-ketoacyl-ACP synthase III (FabH)
Type:
Enzyme
Mol. Mass.:
33506.68
Organism:
Escherichia coli
Description:
C3TDZ2
Residue:
317
  
Inhibitor
Name:
BDBM50276635
Synonyms:
2-hydroxy-5-(5-methyl-4-oxo-2-thioxotetrahydropyrimidin-1(2H)-yl)benzoic acid | CHEMBL456426
Type:
Small organic molecule
Emp. Form.:
C12H12N2O4S
Mol. Mass.:
280.3
SMILES:
CC1CN(C(=S)NC1=O)c1ccc(O)c(c1)C(O)=O
: