Target
Neurotensin receptor type 1
Ligand
BDBM50248172
Substrate
Meas. Tech.
ChEMBL_566215 (CHEMBL963296)
EC50
178±n/a nM
Citation
 Thomas, JBNavarro, HWarner, KRGilmour, B The identification of nonpeptide neurotensin receptor partial agonists from the potent antagonist SR48692 using a calcium mobilization assay. Bioorg Med Chem Lett 19:1438-41 (2009)  
Target
Name:
Neurotensin receptor type 1
Synonyms:
Dopamine receptor D2L/neurotensin receptor NTS1 NTRR Neurotensin receptor 1 | neurotensin receptor type 1
Type:
PROTEIN
Mol. Mass.:
46278.89
Organism:
Homo sapiens (Human)
Description:
ChEMBL_1453811
Residue:
418
  
Inhibitor
Name:
BDBM50248172
Synonyms:
(S)-4-methyl-2-(2-(5-(quinoline-8-sulfonamido)-1H-indol-1-yl)acetamido)pentanoic acid | CHEMBL463811
Type:
Small organic molecule
Emp. Form.:
C25H26N4O5S
Mol. Mass.:
494.563
SMILES:
CC(C)C[C@H](NC(=O)Cn1ccc2cc(NS(=O)(=O)c3cccc4cccnc34)ccc12)C(O)=O
: