Target
C-X-C chemokine receptor type 1
Ligand
BDBM50248545
Substrate
Meas. Tech.
ChEMBL_566225 (CHEMBL963306)
Ki
8±n/a nM
Citation
 Biju, PTaveras, AGDwyer, MPYu, YChao, JHipkin, RWFan, XRindgen, DFine, JLundell, D Fluoroalkyl alpha side chain containing 3,4-diamino-cyclobutenediones as potent and orally bioavailable CXCR2-CXCR1 dual antagonists. Bioorg Med Chem Lett 19:1431-3 (2009)  
Target
Name:
C-X-C chemokine receptor type 1
Synonyms:
C-X-C chemokine receptor type 1 (CXCR-1) CMKAR1 CXCR1_HUMAN Interleukin-8 receptor A | Interleukin-8 receptors, CXCR1/CXCR2
Type:
Enzyme
Mol. Mass.:
39803.83
Organism:
Homo sapiens (Human)
Description:
P25024
Residue:
350
  
Inhibitor
Name:
BDBM50248545
Synonyms:
(S)-3-(2-(1-(benzo[d][1,3]dioxol-5-yl)-2,2,2-trifluoroethylamino)-3,4-dioxocyclobut-1-enylamino)-2-hydroxy-N,N-dimethylbenzamide | CHEMBL518857
Type:
Small organic molecule
Emp. Form.:
C22H18F3N3O6
Mol. Mass.:
477.39
SMILES:
CN(C)C(=O)c1cccc(Nc2c(N[C@@H](c3ccc4OCOc4c3)C(F)(F)F)c(=O)c2=O)c1O
: