Target
C-X-C chemokine receptor type 2
Ligand
BDBM50248400
Substrate
Meas. Tech.
ChEMBL_566224 (CHEMBL963305)
Ki
10±n/a nM
Citation
 Biju, PTaveras, AGDwyer, MPYu, YChao, JHipkin, RWFan, XRindgen, DFine, JLundell, D Fluoroalkyl alpha side chain containing 3,4-diamino-cyclobutenediones as potent and orally bioavailable CXCR2-CXCR1 dual antagonists. Bioorg Med Chem Lett 19:1431-3 (2009)  
Target
Name:
C-X-C chemokine receptor type 2
Synonyms:
C-X-C chemokine receptor type 2 (CXCR-2) CD_antigen=CD182 CXCR-2 CXCR2_HUMAN GRO/MGSA receptor IL-8 receptor type 2 IL8RB | Interleukin-8 receptor B
Type:
Protein
Mol. Mass.:
40767.88
Organism:
Homo sapiens (Human)
Description:
P25025
Residue:
360
  
Inhibitor
Name:
BDBM50248400
Synonyms:
(S)-3-(2-(2,2-difluoro-1-(5-methylfuran-2-yl)propylamino)-3,4-dioxocyclobut-1-enylamino)-2-hydroxy-N,N-dimethylbenzamide | CHEMBL491330
Type:
Small organic molecule
Emp. Form.:
C21H21F2N3O5
Mol. Mass.:
433.4053
SMILES:
CN(C)C(=O)c1cccc(Nc2c(N[C@@H](c3ccc(C)o3)C(C)(F)F)c(=O)c2=O)c1O
: