Target
C-X-C chemokine receptor type 2
Ligand
BDBM50248501
Substrate
Meas. Tech.
ChEMBL_566224 (CHEMBL963305)
Ki
5±n/a nM
Citation
 Biju, PTaveras, AGDwyer, MPYu, YChao, JHipkin, RWFan, XRindgen, DFine, JLundell, D Fluoroalkyl alpha side chain containing 3,4-diamino-cyclobutenediones as potent and orally bioavailable CXCR2-CXCR1 dual antagonists. Bioorg Med Chem Lett 19:1431-3 (2009)  
Target
Name:
C-X-C chemokine receptor type 2
Synonyms:
C-X-C chemokine receptor type 2 (CXCR-2) CD_antigen=CD182 CXCR-2 CXCR2_HUMAN GRO/MGSA receptor IL-8 receptor type 2 IL8RB | Interleukin-8 receptor B
Type:
Protein
Mol. Mass.:
40767.88
Organism:
Homo sapiens (Human)
Description:
P25025
Residue:
360
  
Inhibitor
Name:
BDBM50248501
Synonyms:
(S)-3-(2-(1-(4,5-dichlorofuran-2-yl)-2,2,2-trifluoroethylamino)-3,4-dioxocyclobut-1-enylamino)-2-hydroxy-N,N-dimethylbenzamide | CHEMBL523807
Type:
Small organic molecule
Emp. Form.:
C19H14Cl2F3N3O5
Mol. Mass.:
492.233
SMILES:
CN(C)C(=O)c1cccc(Nc2c(N[C@@H](c3cc(Cl)c(Cl)o3)C(F)(F)F)c(=O)c2=O)c1O
: