Target
Neuronal acetylcholine receptor subunit alpha-4
Ligand
BDBM50248045
Substrate
Meas. Tech.
ChEMBL_566265 (CHEMBL953568)
IC50
25118.86±n/a nM
Citation
 Enz, AFeuerbach, DFrederiksen, MUGentsch, CHurth, KMüller, WNozulak, JRoy, BL Gamma-lactams--a novel scaffold for highly potent and selective alpha 7 nicotinic acetylcholine receptor agonists. Bioorg Med Chem Lett 19:1287-91 (2009)  
Target
Name:
Neuronal acetylcholine receptor subunit alpha-4
Synonyms:
ACHA4_HUMAN CHRNA4 protein Neuronal acetylcholine receptor protein alpha-4 subunit Nicotinic acetylcholine receptor alpha4/beta2/alpha5
Type:
Mol. Mass.:
69963.49
Organism:
Homo sapiens (Human)
Description:
NACHRA4
Residue:
627
  
Inhibitor
Name:
BDBM50248045
Synonyms:
(S)-1-(2-fluorophenyl)ethyl (S)-quinuclidin-3-ylcarbamate | CHEMBL499536
Type:
Small organic molecule
Emp. Form.:
C16H21FN2O2
Mol. Mass.:
292.3485
SMILES:
C[C@H](OC(=O)N[C@@H]1CN2CCC1CC2)c1ccccc1F
: