Target
Fatty acid-binding protein, adipocyte
Ligand
BDBM50248196
Substrate
Meas. Tech.
ChEMBL_566942 (CHEMBL964125)
IC50
550±n/a nM
Citation
 Barf, TLehmann, FHammer, KHaile, SAxen, EMedina, CUppenberg, JSvensson, SRondahl, LLundbäck, T N-Benzyl-indolo carboxylic acids: Design and synthesis of potent and selective adipocyte fatty-acid binding protein (A-FABP) inhibitors. Bioorg Med Chem Lett 19:1745-8 (2009)  
Target
Name:
Fatty acid-binding protein, adipocyte
Synonyms:
A-FABP ALBP FABP4 Fatty acid binding protein adipocyte Fatty acid-binding protein 4 (FABP4)
Type:
Enzyme
Mol. Mass.:
14719.23
Organism:
Homo sapiens (Human)
Description:
P15090
Residue:
132
  
Inhibitor
Name:
BDBM50248196
Synonyms:
9-(3-methoxybenzyl)-2,3,4,9-tetrahydro-1H-carbazole-8-carboxylic acid | CHEMBL514666
Type:
Small organic molecule
Emp. Form.:
C21H21NO3
Mol. Mass.:
335.3963
SMILES:
COc1cccc(Cn2c3CCCCc3c3cccc(C(O)=O)c23)c1
: