Target
Low molecular weight phosphotyrosine protein phosphatase
Ligand
BDBM50267143
Substrate
Meas. Tech.
ChEMBL_563764 (CHEMBL993527)
IC50
344900±n/a nM
Citation
 Ottanà, RMaccari, RCiurleo, RPaoli, PJacomelli, MManao, GCamici, GLaggner, CLanger, T 5-Arylidene-2-phenylimino-4-thiazolidinones as PTP1B and LMW-PTP inhibitors. Bioorg Med Chem 17:1928-37 (2009)  
Target
Name:
Low molecular weight phosphotyrosine protein phosphatase
Synonyms:
LTP1 | PPAL_YEAST
Type:
PROTEIN
Mol. Mass.:
18678.01
Organism:
Saccharomyces cerevisiae
Description:
ChEMBL_563764
Residue:
161
  
Inhibitor
Name:
BDBM50267143
Synonyms:
4-[5-(3-Carboxy-4-hydroxybenzylidene)-4-oxo-2-phenyliminothiazolidin-3-ylmethyl]benzoic acid | CHEMBL478312
Type:
Small organic molecule
Emp. Form.:
C25H18N2O6S
Mol. Mass.:
474.485
SMILES:
OC(=O)c1ccc(CN2\C(S\C(=C/c3ccc(O)c(c3)C(O)=O)C2=O)=N\c2ccccc2)cc1
: