Target
Fatty acid synthase
Ligand
BDBM50256128
Substrate
Meas. Tech.
ChEMBL_563949 (CHEMBL965857)
IC50
15530±n/a nM
Citation
 Wang, XLin, JChen, YZhong, WZhao, GLiu, HLi, SWang, LLi, S Novel fatty acid synthase (FAS) inhibitors: design, synthesis, biological evaluation, and molecular docking studies. Bioorg Med Chem 17:1898-904 (2009)  
Target
Name:
Fatty acid synthase
Synonyms:
FAS_RAT | Fasn
Type:
PROTEIN
Mol. Mass.:
272640.19
Organism:
Rattus norvegicus
Description:
ChEMBL_940338
Residue:
2505
  
Inhibitor
Name:
BDBM50256128
Synonyms:
(2R,3S)-4-methylene-2-octyl-5-oxotetrahydrofuran-3-carboxylic acid CHEMBL449993
Type:
Small organic molecule
Emp. Form.:
C14H22O4
Mol. Mass.:
254.3221
SMILES:
CCCCCCCC[C@H]1OC(=O)C(=C)[C@@H]1C(O)=O
: