Target
SHC-transforming protein 1
Ligand
BDBM50276338
Substrate
Meas. Tech.
ChEMBL_542408 (CHEMBL1010645)
IC50
89000±n/a nM
Citation
 Choi, WJKim, SEStephen, AGWeidlich, IGiubellino, ALiu, FWorthy, KMBindu, LFivash, MJNicklaus, MCBottaro, DPFisher, RJBurke, TR Identification of Shc Src homology 2 domain-binding peptoid-peptide hybrids. J Med Chem 52:1612-8 (2009)  
Target
Name:
SHC-transforming protein 1
Synonyms:
SHC SHC1_HUMAN | SHCA
Type:
PROTEIN
Mol. Mass.:
62820.39
Organism:
Homo sapiens (Human)
Description:
ChEMBL_542407
Residue:
583
  
Inhibitor
Name:
BDBM50276338
Synonyms:
4-((2S,5S,11S,14S)-2-acetamido-5-(3-amino-3-oxopropyl)-10-(but-3-enyl)-14-(hydroxymethyl)-11-isobutyl-3,6,9,12,15-pentaoxo-4,7,10,13,16-pentaazaicos-19-enyl)phenyl dihydrogen phosphate | CHEMBL503497
Type:
Small organic molecule
Emp. Form.:
C35H54N7O12P
Mol. Mass.:
795.8167
SMILES:
CC(C)C[C@H](N(CCC=C)C(=O)CNC(=O)[C@H](CCC(N)=O)NC(=O)[C@H](Cc1ccc(OP(O)(O)=O)cc1)NC(C)=O)C(=O)N[C@@H](CO)C(=O)NCCC=C
: