Target
P2X purinoceptor 3
Ligand
BDBM50413362
Substrate
Meas. Tech.
ChEMBL_562361 (CHEMBL1017975)
IC50
126±n/a nM
Citation
 Jahangir, AAlam, MCarter, DSDillon, MPBois, DJFord, APGever, JRLin, CWagner, PJZhai, YZira, J Identification and SAR of novel diaminopyrimidines. Part 2: The discovery of RO-51, a potent and selective, dual P2X(3)/P2X(2/3) antagonist for the treatment of pain. Bioorg Med Chem Lett 19:1632-5 (2009)  
Target
Name:
P2X purinoceptor 3
Synonyms:
ATP receptor P2X purinoceptor 3 P2rx3 ratp2x3 | ratp2x3 + rsa
Type:
Enzyme Catalytic Domain
Mol. Mass.:
44397.63
Organism:
RAT
Description:
Purinergic, P2X3 0 RAT::P49654
Residue:
397
  
Inhibitor
Name:
BDBM50413362
Synonyms:
CHEMBL493547
Type:
Small organic molecule
Emp. Form.:
C19H25IN4O3
Mol. Mass.:
484.3313
SMILES:
COc1cc(C(C)C)c(Oc2cnc(NC3CCOCC3)nc2N)cc1I
: