Target
P2X purinoceptor 2
Ligand
BDBM50413353
Substrate
Meas. Tech.
ChEMBL_562362 (CHEMBL1017976)
IC50
200±n/a nM
Citation
 Jahangir, AAlam, MCarter, DSDillon, MPBois, DJFord, APGever, JRLin, CWagner, PJZhai, YZira, J Identification and SAR of novel diaminopyrimidines. Part 2: The discovery of RO-51, a potent and selective, dual P2X(3)/P2X(2/3) antagonist for the treatment of pain. Bioorg Med Chem Lett 19:1632-5 (2009)  
Target
Name:
P2X purinoceptor 2
Synonyms:
ATP receptor P2RX2_HUMAN Purinergic receptor | PurinergicP2X2/3
Type:
Enzyme Catalytic Domain
Mol. Mass.:
51765.18
Organism:
Homo sapiens (Human)
Description:
PurinergicP2X2/3 0 HUMAN::Q9UBL9
Residue:
471
  
Inhibitor
Name:
BDBM50413353
Synonyms:
CHEMBL493741
Type:
Small organic molecule
Emp. Form.:
C16H18F3IN4O2
Mol. Mass.:
482.2394
SMILES:
COc1cc(C(C)C)c(Oc2cnc(NCC(F)(F)F)nc2N)cc1I
: