Target
P2X purinoceptor 2
Ligand
BDBM50413387
Substrate
Meas. Tech.
ChEMBL_565944 (CHEMBL960839)
IC50
<10000±n/a nM
Citation
 Carter, DSAlam, MCai, HDillon, MPFord, APGever, JRJahangir, ALin, CMoore, AGWagner, PJZhai, Y Identification and SAR of novel diaminopyrimidines. Part 1: The discovery of RO-4, a dual P2X(3)/P2X(2/3) antagonist for the treatment of pain. Bioorg Med Chem Lett 19:1628-31 (2009)  
Target
Name:
P2X purinoceptor 2
Synonyms:
ATP receptor P2RX2_HUMAN Purinergic receptor | PurinergicP2X2/3
Type:
Enzyme Catalytic Domain
Mol. Mass.:
51765.18
Organism:
Homo sapiens (Human)
Description:
PurinergicP2X2/3 0 HUMAN::Q9UBL9
Residue:
471
  
Inhibitor
Name:
BDBM50413387
Synonyms:
CHEMBL492786
Type:
Small organic molecule
Emp. Form.:
C17H22N4O2
Mol. Mass.:
314.3822
SMILES:
COc1cc(Cc2cnc(N)nc2N)c(cc1OC)C1CCC1
: