Target
Coagulation factor X
Ligand
BDBM50266924
Substrate
Meas. Tech.
ChEMBL_564153 (CHEMBL956073)
IC50
1.32±n/a nM
Citation
 Van Huis, CACasimiro-Garcia, ABigge, CFCody, WLDudley, DAFilipski, KJHeemstra, RJKohrt, JTLeadley, RJNarasimhan, LSMcClanahan, TMochalkin, IPamment, MPeterson, JTSahasrabudhe, VSchaum, RPEdmunds, JJ Exploration of 4,4-disubstituted pyrrolidine-1,2-dicarboxamides as potent, orally active Factor Xa inhibitors with extended duration of action. Bioorg Med Chem 17:2501-11 (2009)  
Target
Name:
Coagulation factor X
Synonyms:
Coagulation factor X precursor FA10_RAT Stuart factor
Type:
Enzyme
Mol. Mass.:
54255.03
Organism:
Rattus norvegicus (rat)
Description:
Residue:
482
  
Inhibitor
Name:
BDBM50266924
Synonyms:
(2R,4S)-N1-(4-Chlorophenyl)-4-(2,4-difluorophenyl)-4-hydroxy-N2-(5-(2-oxopyridin-1(2H)-yl)pyridin-2-yl)pyrrolidine-1,2-dicarboxamide CHEMBL474678
Type:
Small organic molecule
Emp. Form.:
C28H22ClF2N5O4
Mol. Mass.:
565.955
SMILES:
O[C@@]1(C[C@@H](N(C1)C(=O)Nc1ccc(Cl)cc1)C(=O)Nc1ccc(cn1)-n1ccccc1=O)c1ccc(F)cc1F
: