Target
Carbonic anhydrase 2
Ligand
BDBM50058046
Substrate
Meas. Tech.
ChEMBL_564155 (CHEMBL956075)
Ki
19500±n/a nM
Citation
 Sentürk, MGülçin, IDastan, AKüfrevioqlu, OISupuran, CT Carbonic anhydrase inhibitors. Inhibition of human erythrocyte isozymes I and II with a series of antioxidant phenols. Bioorg Med Chem 17:3207-11 (2009)  
Target
Name:
Carbonic anhydrase 2
Synonyms:
CA-II CAC Carbonate dehydratase II Carbonic anhydrase 2 (CA-II) Carbonic anhydrase C Carbonic anhydrase II (CA-II) Carbonic anhydrase II (hCA II) | Carbonic anhydrase isoenzyme II (hCA II)
Type:
Enzyme
Mol. Mass.:
29250.71
Organism:
Homo sapiens (Human)
Description:
P00918
Residue:
260
  
Inhibitor
Name:
BDBM50058046
Synonyms:
CHEMBL526 | propofol
Type:
Small organic molecule
Emp. Form.:
C12H18O
Mol. Mass.:
178.2707
SMILES:
CC(C)c1cccc(C(C)C)c1O
: