Target
Metabotropic glutamate receptor 1
Ligand
BDBM50258227
Substrate
Meas. Tech.
ChEMBL_566316 (CHEMBL956826)
EC50
161±n/a nM
Citation
 Vieira, EHuwyler, JJolidon, SKnoflach, FMutel, VWichmann, J Fluorinated 9H-xanthene-9-carboxylic acid oxazol-2-yl-amides as potent, orally available mGlu1 receptor enhancers. Bioorg Med Chem Lett 19:1666-9 (2009)  
Target
Name:
Metabotropic glutamate receptor 1
Synonyms:
GRM1_RAT Grm1 Metabotropic glutamate receptor Mglur1 metabotropic glutamate 1/5-D metabotropic glutamate receptor 1 isoform alpha precursor
Type:
Enzyme Catalytic Domain
Mol. Mass.:
133240.47
Organism:
RAT
Description:
metabotropic glutamate 1/2 0 RAT::P23385
Residue:
1199
  
Inhibitor
Name:
BDBM50258227
Synonyms:
4,5-difluoro-N-(4-(trifluoromethyl)oxazol-2-yl)-9H-xanthene-9-carboxamide | CHEMBL494967
Type:
Small organic molecule
Emp. Form.:
C18H9F5N2O3
Mol. Mass.:
396.2677
SMILES:
Fc1cccc2C(C(=O)Nc3nc(co3)C(F)(F)F)c3cccc(F)c3Oc12
: