Target
Estrogen receptor beta
Ligand
BDBM50276473
Substrate
Meas. Tech.
ChEMBL_542869 (CHEMBL1022146)
IC50
>10000±n/a nM
Citation
 Robinson, RPBuckbinder, LHaugeto, AIMcNiff, PAMillham, MLReese, MRSchaefer, JFAbramov, YABordner, JChantigny, YAKleinman, EFLaird, ERMorgan, BPMurray, JCSalter, EDWessel, MDYocum, SA Octahydrophenanthrene-2,7-diol analogues as dissociated glucocorticoid receptor agonists: discovery and lead exploration. J Med Chem 52:1731-43 (2009)  
Target
Name:
Estrogen receptor beta
Synonyms:
ER-beta ESR2_HUMAN Estradiol receptor beta (ERβ) Estrogen receptor (ER beta) Estrogen receptor beta (ER beta) NR3A2 estrogen beta
Type:
Protein
Mol. Mass.:
59238.43
Organism:
Homo sapiens (Human)
Description:
Q92731
Residue:
530
  
Inhibitor
Name:
BDBM50276473
Synonyms:
(2S,4R,4aR,10aR)-4a-Ethyl-2-prop-1-ynyl-1,2,3,4,4a,9,10,10aoctahydro-phenanthrene-2,4,7-triol | CHEMBL457242
Type:
Small organic molecule
Emp. Form.:
C19H24O3
Mol. Mass.:
300.3921
SMILES:
CC[C@@]12[C@H](O)C[C@@](O)(C[C@H]1CCc1cc(O)ccc21)C#CC
: