Target
Glucocorticoid receptor
Ligand
BDBM50276129
Substrate
Meas. Tech.
ChEMBL_542867 (CHEMBL1022144)
IC50
1.3±n/a nM
Citation
 Robinson, RPBuckbinder, LHaugeto, AIMcNiff, PAMillham, MLReese, MRSchaefer, JFAbramov, YABordner, JChantigny, YAKleinman, EFLaird, ERMorgan, BPMurray, JCSalter, EDWessel, MDYocum, SA Octahydrophenanthrene-2,7-diol analogues as dissociated glucocorticoid receptor agonists: discovery and lead exploration. J Med Chem 52:1731-43 (2009)  
Target
Name:
Glucocorticoid receptor
Synonyms:
GCR_HUMAN GRL Glucocorticoid receptor (GRFP) Nuclear receptor subfamily 3 group C member 1
Type:
Enzyme
Mol. Mass.:
85656.87
Organism:
Homo sapiens (Human)
Description:
P04150
Residue:
777
  
Inhibitor
Name:
BDBM50276129
Synonyms:
(2S,4bR,8aR)-4b-Ethyl-7-phenyl-4b,5,6,7,8,8a,9,10-octahydrophenanthrene-2,6-diol | CHEMBL469944
Type:
Small organic molecule
Emp. Form.:
C22H26O2
Mol. Mass.:
322.4406
SMILES:
CC[C@@]12C[C@H](O)[C@@H](C[C@H]1CCc1cc(O)ccc21)c1ccccc1
: