Target
Cannabinoid receptor 2
Ligand
BDBM50211843
Substrate
Meas. Tech.
ChEMBL_567044 (CHEMBL1029952)
Ki
>5000±n/a nM
Citation
 Zindell, RRiether, DBosanac, TBerry, AGemkow, MJEbneth, ALöbbe, SRaymond, ELThome, DShih, DTThomson, D Morpholine containing CB2 selective agonists. Bioorg Med Chem Lett 19:1604-9 (2009)  
Target
Name:
Cannabinoid receptor 2
Synonyms:
CANNABINOID CB2 CB2 CB2B CNR2_HUMAN Cannabinoid CB2 receptor Cannabinoid receptor 2 (CB2R) | hCB2
Type:
G Protein-Coupled Receptor (GPCR)
Mol. Mass.:
39690.94
Organism:
Homo sapiens (Human)
Description:
P34972
Residue:
360
  
Inhibitor
Name:
BDBM50211843
Synonyms:
2-(2,4-dichlorophenylamino)-4-trifluoromethyl-pyrimidine-5-carboxylic acid N-(tetrahydropyran-4-ylmethyl)amide CHEMBL225411 GW-842166X
Type:
Small organic molecule
Emp. Form.:
C18H17Cl2F3N4O2
Mol. Mass.:
449.254
SMILES:
FC(F)(F)c1nc(Nc2ccc(Cl)cc2Cl)ncc1C(=O)NCC1CCOCC1
: