Target
Insulin receptor
Ligand
BDBM50257962
Substrate
Meas. Tech.
ChEMBL_562395 (CHEMBL1018828)
IC50
420±n/a nM
Citation
 Riether, DZindell, RKowalski, JACook, BNBentzien, JLombaert, SDThomson, DKugler, SZSkow, DMartin, LSRaymond, ELKhine, HHO'Shea, KWoska, JRJeanfavre, DSellati, RRalph, KLAhlberg, JLabissiere, GKashem, MAPullen, SSTakahashi, H 5-Aminomethylbenzimidazoles as potent ITK antagonists. Bioorg Med Chem Lett 19:1588-91 (2009)  
Target
Name:
Insulin receptor
Synonyms:
INSR INSR_HUMAN Insulin receptor beta subunit
Type:
Receptor Tyrosine Kinase
Mol. Mass.:
156322.60
Organism:
Homo sapiens (Human)
Description:
P06213
Residue:
1382
  
Inhibitor
Name:
BDBM50257962
Synonyms:
CHEMBL494743 | N-(1-(2-hydroxy-2-methylpropyl)-5-((3-hydroxypyrrolidin-1-yl)methyl)-1H-benzo[d]imidazol-2(3H)-ylidene)-5-(1H-pyrazol-4-yl)thiophene-2-carboxamide
Type:
Small organic molecule
Emp. Form.:
C24H28N6O3S
Mol. Mass.:
480.583
SMILES:
CC(C)(O)Cn1c(NC(=O)c2ccc(s2)-c2cn[nH]c2)nc2cc(CN3CCC(O)C3)ccc12
: