Target
Tyrosine-protein kinase ITK/TSK
Ligand
BDBM50257656
Substrate
Meas. Tech.
ChEMBL_562394 (CHEMBL1018827)
IC50
940±n/a nM
Citation
 Riether, DZindell, RKowalski, JACook, BNBentzien, JLombaert, SDThomson, DKugler, SZSkow, DMartin, LSRaymond, ELKhine, HHO'Shea, KWoska, JRJeanfavre, DSellati, RRalph, KLAhlberg, JLabissiere, GKashem, MAPullen, SSTakahashi, H 5-Aminomethylbenzimidazoles as potent ITK antagonists. Bioorg Med Chem Lett 19:1588-91 (2009)  
Target
Name:
Tyrosine-protein kinase ITK/TSK
Synonyms:
EMT ITK_HUMAN LYK Tyrosine-protein kinase ITK Tyrosine-protein kinase Lyk
Type:
Protein
Mol. Mass.:
71839.20
Organism:
Homo sapiens (Human)
Description:
Q08881
Residue:
620
  
Inhibitor
Name:
BDBM50257656
Synonyms:
CHEMBL493107 | N-(5-((cyclohexylamino)methyl)-1-(2-hydroxy-2-methylpropyl)-1H-benzo[d]imidazol-2(3H)-ylidene)-5-(2-methyloxazol-5-yl)thiophene-2-carboxamide
Type:
Small organic molecule
Emp. Form.:
C27H33N5O3S
Mol. Mass.:
507.648
SMILES:
Cc1ncc(o1)-c1ccc(s1)C(=O)Nc1nc2cc(CNC3CCCCC3)ccc2n1CC(C)(C)O
: