Target
MO15-related protein kinase Pfmrk
Ligand
BDBM50278866
Substrate
Meas. Tech.
ChEMBL_564380 (CHEMBL962375)
IC50
12000±n/a nM
Citation
 Geyer, JAKeenan, SMWoodard, CLThompson, PAGerena, LNichols, DAGutteridge, CEWaters, NC Selective inhibition of Pfmrk, a Plasmodium falciparum CDK, by antimalarial 1,3-diaryl-2-propenones. Bioorg Med Chem Lett 19:1982-5 (2009)  
Target
Name:
MO15-related protein kinase Pfmrk
Synonyms:
Protein kinase Pfmrk
Type:
PROTEIN
Mol. Mass.:
37992.30
Organism:
Plasmodium falciparum
Description:
ChEMBL_640752
Residue:
324
  
Inhibitor
Name:
BDBM50278866
Synonyms:
1-(4-methoxyphenyl)-3-(pyridin-2-yl)prop-2-en-1-one WR-190706
Type:
Small organic molecule
Emp. Form.:
C15H13NO2
Mol. Mass.:
239.2692
SMILES:
COc1ccc(cc1)C(=O)\C=C\c1ccccn1
: