Target
Mu-type opioid receptor
Ligand
BDBM50248857
Substrate
Meas. Tech.
ChEMBL_543310 (CHEMBL1019447)
EC50
1.3±n/a nM
Citation
 Cami-Kobeci, GNeal, APBradbury, FAPurington, LCAceto, MDHarris, LSLewis, JWTraynor, JRHusbands, SM Mixed kappa/mu opioid receptor agonists: the 6 beta-naltrexamines. J Med Chem 52:1546-52 (2009)  
Target
Name:
Mu-type opioid receptor
Synonyms:
MOR-1 Mu-type opioid receptor (MOR) OPRM_RAT Opioid receptor B Ror-b
Type:
G Protein-Coupled Receptor (GPCR)
Mol. Mass.:
44503.11
Organism:
Rattus norvegicus (rat)
Description:
Competition binding assays were carried out using membrane preparations from transfected HN9.10 cells that constitutively expressed the mu opioid receptor.
Residue:
398
  
Inhibitor
Name:
BDBM50248857
Synonyms:
(1S,5R,13R,14R,17S)-4-(cyclopropylmethyl)-10-hydroxy-14-[(2E)-3-phenylprop-2-enamido]-12-oxa-4-azapentacyclo[9.6.1.0^{1,13}.0^{5,17}.0^{7,18}]octadeca-7(18),8,10-trien-17-yl 2-phenylacetate | CHEMBL503017
Type:
Small organic molecule
Emp. Form.:
C37H38N2O5
Mol. Mass.:
590.708
SMILES:
Oc1ccc2C[C@H]3N(CC4CC4)CC[C@@]45[C@@H](Oc1c24)[C@@H](CC[C@@]35OC(=O)Cc1ccccc1)NC(=O)\C=C\c1ccccc1
: