Target
Kappa-type opioid receptor
Ligand
BDBM50248795
Substrate
Meas. Tech.
ChEMBL_543309 (CHEMBL1019446)
Ki
0.36±n/a nM
Citation
 Cami-Kobeci, GNeal, APBradbury, FAPurington, LCAceto, MDHarris, LSLewis, JWTraynor, JRHusbands, SM Mixed kappa/mu opioid receptor agonists: the 6 beta-naltrexamines. J Med Chem 52:1546-52 (2009)  
Target
Name:
Kappa-type opioid receptor
Synonyms:
K-OR-1 Kappa-opioid receptor (KOR) Kappa-type opioid receptor (KOR) OPIATE Kappa OPRK1 kappa opioid receptor (KOR)
Type:
G Protein-Coupled Receptor (GPCR)
Mol. Mass.:
42648.76
Organism:
Homo sapiens (Human)
Description:
P41145
Residue:
380
  
Inhibitor
Name:
BDBM50248795
Synonyms:
(2E)-N-[(1S,5R,13R,14R,17S)-4-(cyclopropylmethyl)-10,17-dihydroxy-12-oxa-4-azapentacyclo[9.6.1.0^{1,13}.0^{5,17}.0^{7,18}]octadeca-7(18),8,10-trien-14-yl]-3-(3-nitrophenyl)prop-2-enamide | CHEMBL454018
Type:
Small organic molecule
Emp. Form.:
C29H31N3O6
Mol. Mass.:
517.5729
SMILES:
Oc1ccc2C[C@H]3N(CC4CC4)CC[C@@]45[C@@H](Oc1c24)[C@@H](CC[C@@]35O)NC(=O)\C=C\c1cccc(c1)[N+]([O-])=O
: