Target
Phospholipase D1
Ligand
BDBM50257528
Substrate
Meas. Tech.
ChEMBL_566795 (CHEMBL957604)
IC50
6.4±n/a nM
Citation
 Lewis, JAScott, SALavieri, RBuck, JRSelvy, PEStoops, SLArmstrong, MDBrown, HALindsley, CW Design and synthesis of isoform-selective phospholipase D (PLD) inhibitors. Part I: Impact of alternative halogenated privileged structures for PLD1 specificity. Bioorg Med Chem Lett 19:1916-20 (2009)  
Target
Name:
Phospholipase D1
Synonyms:
Choline phosphatase 1 PLD1 Phosphatidylcholine-hydrolyzing phospholipase D1 Phospholipase D1 Phospholipase D2 (PLD2) | hPLD1
Type:
Protein
Mol. Mass.:
124219.92
Organism:
Homo sapiens (Human)
Description:
Q13393
Residue:
1074
  
Inhibitor
Name:
BDBM50257528
Synonyms:
(S)-4-chloro-N-(1-(4-(5-chloro-2-oxo-2,3-dihydro-1H-benzo[d]imidazol-1-yl)piperidin-1-yl)propan-2-yl)benzamide | CHEMBL494145
Type:
Small organic molecule
Emp. Form.:
C22H24Cl2N4O2
Mol. Mass.:
447.358
SMILES:
C[C@@H](CN1CCC(CC1)n1c2ccc(Cl)cc2[nH]c1=O)NC(=O)c1ccc(Cl)cc1
: