Target
Dipeptidyl peptidase 4
Ligand
BDBM50257042
Substrate
Meas. Tech.
ChEMBL_567091 (CHEMBL1030770)
IC50
13±n/a nM
Citation
 Tsai, TYHsu, TChen, CTCheng, JHChiou, MCHuang, CHTseng, YJYeh, TKHuang, CYYeh, KCHuang, YWWu, SHWang, MHChen, XChao, YSJiaang, WT Rational design and synthesis of potent and long-lasting glutamic acid-based dipeptidyl peptidase IV inhibitors. Bioorg Med Chem Lett 19:1908-12 (2009)  
Target
Name:
Dipeptidyl peptidase 4
Synonyms:
ADABP Adenosine deaminase complexing protein 2 CD_antigen=CD26 DPP4 DPPIV Dipeptidyl peptidase 4 (DPP IV) Dipeptidyl peptidase 4 (DPP4) Dipeptidyl peptidase 4 membrane form Dipeptidyl peptidase IV Dipeptidyl peptidase IV (DDP-IV) Dipeptidyl peptidase IV membrane form Dipeptidyl peptidase-IV (DPP-4) T-cell activation antigen CD26 | TP103
Type:
Enzyme
Mol. Mass.:
88271.01
Organism:
Homo sapiens (Human)
Description:
P27487
Residue:
766
  
Inhibitor
Name:
BDBM50257042
Synonyms:
(S)-1-((S)-2-cyanopyrrolidin-1-yl)-3,3-dimethyl-5-((R)-2-methylpyrrolidin-1-yl)-1,5-dioxopentan-2-aminium 2,2,2-trifluoroacetate | CHEMBL514317
Type:
Small organic molecule
Emp. Form.:
C17H29N4O2
Mol. Mass.:
321.4372
SMILES:
C[C@@H]1CCCN1C(=O)CC(C)(C)[C@H]([NH3+])C(=O)N1CCC[C@H]1C#N
: