Target
Gonadotropin-releasing hormone receptor
Ligand
BDBM50256835
Substrate
Meas. Tech.
ChEMBL_562460 (CHEMBL1010963)
IC50
5.6±n/a nM
Citation
 Pelletier, JCChengalvala, MVCottom, JEFeingold, IBGreen, DMHauze, DBHuselton, CAJetter, JWKopf, GSLundquist, JTMagolda, RLMann, CWMehlmann, JFRogers, JFShanno, LKAdams, WRTio, COWrobel, JE Discovery of 6-({4-[2-(4-tert-butylphenyl)-1H-benzimidazol-4-yl]piperazin-1-yl}methyl)quinoxaline (WAY-207024): an orally active antagonist of the gonadotropin releasing hormone receptor (GnRH-R). J Med Chem 52:2148-52 (2009)  
Target
Name:
Gonadotropin-releasing hormone receptor
Synonyms:
GNRHR GRHR GnRH-R Gonadotropin-releasing hormone receptor | Gonadotropin-releasing hormone receptor (GnRH)
Type:
Enzyme
Mol. Mass.:
37749.45
Organism:
Homo sapiens (Human)
Description:
P30968
Residue:
328
  
Inhibitor
Name:
BDBM50256835
Synonyms:
7-((4-(2-(4-tert-butylphenyl)-1H-benzo[d]imidazol-4-yl)piperazin-1-yl)methyl)-1-(pyridin-3-ylmethyl)quinoxaline-2,3(1H,4H)-dione | CHEMBL446978
Type:
Small organic molecule
Emp. Form.:
C36H37N7O2
Mol. Mass.:
599.7247
SMILES:
CC(C)(C)c1ccc(cc1)-c1nc2c(cccc2[nH]1)N1CCN(Cc2ccc3[nH]c(=O)c(=O)n(Cc4cccnc4)c3c2)CC1
: