Target
Histone deacetylase 1
Ligand
BDBM50257133
Substrate
Meas. Tech.
ChEMBL_562513 (CHEMBL1014505)
IC50
500±n/a nM
Citation
 Manku, SAllan, MNguyen, NAjamian, ARodrigue, JTherrien, EWang, JGuo, TRahil, JPetschner, AJNicolescu, ALefebvre, SLi, ZFournel, MBesterman, JMDéziel, RWahhab, A Synthesis and evaluation of lysine derived sulfamides as histone deacetylase inhibitors. Bioorg Med Chem Lett 19:1866-70 (2009)  
Target
Name:
Histone deacetylase 1
Synonyms:
Cereblon/Histone deacetylase 1 HDAC1 Histone deacetylase 1 (HDAC1) RPD3L1
Type:
Enzyme
Mol. Mass.:
55090.27
Organism:
Homo sapiens (Human)
Description:
Q13547
Residue:
482
  
Inhibitor
Name:
BDBM50257133
Synonyms:
(S)-benzyl 1-(2-(4-methoxyphenyl)thiazol-4-yl)-5-(sulfamoylamino)pentylcarbamate | CHEMBL523033
Type:
Small organic molecule
Emp. Form.:
C23H28N4O5S2
Mol. Mass.:
504.622
SMILES:
COc1ccc(cc1)-c1nc(cs1)[C@H](CCCCNS(N)(=O)=O)NC(=O)OCc1ccccc1
: