Target
Prostaglandin G/H synthase 1
Ligand
BDBM50293282
Substrate
Meas. Tech.
ChEMBL_501261 (CHEMBL976163)
IC50
114±n/a nM
Citation
 Feng, ZChu, FGuo, ZSun, P Synthesis and anti-inflammatory activity of the major metabolites of imrecoxib. Bioorg Med Chem Lett 19:2270-2 (2009)  
Target
Name:
Prostaglandin G/H synthase 1
Synonyms:
Cox-1 Cyclooxygenase-1 PGH1_MOUSE PHS 1 Prostaglandin H2 synthase 1 Ptgs1
Type:
PROTEIN
Mol. Mass.:
69044.61
Organism:
Mus musculus
Description:
ChEMBL_10575
Residue:
602
  
Inhibitor
Name:
BDBM50293282
Synonyms:
CHEMBL504535 | Imrecoxib
Type:
Small organic molecule
Emp. Form.:
C21H23NO3S
Mol. Mass.:
369.477
SMILES:
CCCN1CC(=C(C1=O)c1ccc(C)cc1)c1ccc(cc1)S(C)(=O)=O
: