Target
Epidermal growth factor receptor
Ligand
BDBM50278609
Substrate
Meas. Tech.
ChEMBL_501564 (CHEMBL987693)
IC50
10±n/a nM
Citation
 Lin, RJohnson, SGConnolly, PJWetter, SKBinnun, EHughes, TVMurray, WVPandey, NBMoreno-Mazza, SJAdams, MFuentes-Pesquera, ARMiddleton, SA Synthesis and evaluation of 2,7-diamino-thiazolo[4,5-d] pyrimidine analogues as anti-tumor epidermal growth factor receptor (EGFR) tyrosine kinase inhibitors. Bioorg Med Chem Lett 19:2333-7 (2009)  
Target
Name:
Epidermal growth factor receptor
Synonyms:
EGF Receptor Substrate EGFR_HUMAN ERBB1 Epidermal Growth Factor Receptor erbB-1 Epidermal growth factor receptor (EGFR) HER1 Proto-oncogene c-ErbB-1 Tyrosine-Protein Kinase ErbB-1
Type:
Receptor Kinase Domain
Mol. Mass.:
134279.59
Organism:
Homo sapiens (Human)
Description:
P00533
Residue:
1210
  
Inhibitor
Name:
BDBM50278609
Synonyms:
CHEMBL470011 | N7-(3-chloro-4-fluorophenyl)-N2-(4-(piperidin-1-ylmethyl)phenyl)thiazolo[4,5-d]pyrimidine-2,7-diamine
Type:
Small organic molecule
Emp. Form.:
C23H22ClFN6S
Mol. Mass.:
468.977
SMILES:
Fc1ccc(Nc2ncnc3nc(Nc4ccc(CN5CCCCC5)cc4)sc23)cc1Cl
: