Target
Carbonic anhydrase 2
Ligand
BDBM36182
Substrate
Meas. Tech.
ChEMBL_562666 (CHEMBL1011825)
Ki
257000±n/a nM
Citation
 Innocenti, AHall, RASchlicker, CMühlschlegel, FASupuran, CT Carbonic anhydrase inhibitors. Inhibition of the beta-class enzymes from the fungal pathogens Candida albicans and Cryptococcus neoformans with aliphatic and aromatic carboxylates. Bioorg Med Chem 17:2654-7 (2009)  
Target
Name:
Carbonic anhydrase 2
Synonyms:
CA-II CAC Carbonate dehydratase II Carbonic anhydrase 2 (CA-II) Carbonic anhydrase C Carbonic anhydrase II (CA-II) Carbonic anhydrase II (hCA II) | Carbonic anhydrase isoenzyme II (hCA II)
Type:
Enzyme
Mol. Mass.:
29250.71
Organism:
Homo sapiens (Human)
Description:
P00918
Residue:
260
  
Inhibitor
Name:
BDBM36182
Synonyms:
CHEMBL509357 valerate
Type:
Guest
Emp. Form.:
C5H9O2
Mol. Mass.:
101.1243
SMILES:
CCCCC([O-])=O
: