Target
Carbonic anhydrase 2
Ligand
BDBM50159792
Substrate
Meas. Tech.
ChEMBL_562666 (CHEMBL1011825)
Ki
2110000±n/a nM
Citation
 Innocenti, AHall, RASchlicker, CMühlschlegel, FASupuran, CT Carbonic anhydrase inhibitors. Inhibition of the beta-class enzymes from the fungal pathogens Candida albicans and Cryptococcus neoformans with aliphatic and aromatic carboxylates. Bioorg Med Chem 17:2654-7 (2009)  
Target
Name:
Carbonic anhydrase 2
Synonyms:
CA-II CAC Carbonate dehydratase II Carbonic anhydrase 2 (CA-II) Carbonic anhydrase C Carbonic anhydrase II (CA-II) Carbonic anhydrase II (hCA II) | Carbonic anhydrase isoenzyme II (hCA II)
Type:
Enzyme
Mol. Mass.:
29250.71
Organism:
Homo sapiens (Human)
Description:
P00918
Residue:
260
  
Inhibitor
Name:
BDBM50159792
Synonyms:
CHEMBL181886 Pyruvate sodium 2-oxopropanoate | sodium pyruvate
Type:
Small organic molecule
Emp. Form.:
C3H3O3
Mol. Mass.:
87.0547
SMILES:
CC(=O)C([O-])=O
: