Target
Chitinase B
Ligand
BDBM50257244
Substrate
Meas. Tech.
ChEMBL_562670 (CHEMBL1011829)
IC50
2700±n/a nM
Citation
 Sunazuka, TSugawara, AIguchi, KHirose, TNagai, KNoguchi, YSaito, YYamamoto, TUi, HGouda, HShiomi, KWatanabe, TOmura, S Argifin; efficient solid phase total synthesis and evaluation of analogues of acyclic peptide. Bioorg Med Chem 17:2751-8 (2009)  
Target
Name:
Chitinase B
Synonyms:
CHIB_SERMA | chiB
Type:
Enzyme
Mol. Mass.:
55462.70
Organism:
Serratia marcescens
Description:
P11797
Residue:
499
  
Inhibitor
Name:
BDBM50257244
Synonyms:
CHEMBL522670 | N-Ac-D-Ala-Arg{N-omega-(N-methylcarbanoyl)}-N-methyl-Phe-OH
Type:
Small organic molecule
Emp. Form.:
C23H35N7O6
Mol. Mass.:
505.5673
SMILES:
CNC(=O)NC(N)=NCCC[C@H](NC(=O)[C@@H](C)NC(C)=O)C(=O)N(C)[C@@H](Cc1ccccc1)C(O)=O
: