Target
Low molecular weight phosphotyrosine protein phosphatase
Ligand
BDBM50257294
Substrate
Meas. Tech.
ChEMBL_562673 (CHEMBL1011832)
IC50
5700±n/a nM
Citation
 Forghieri, MLaggner, CPaoli, PLanger, TManao, GCamici, GBondioli, LPrati, FCostantino, L Synthesis, activity and molecular modeling of a new series of chromones as low molecular weight protein tyrosine phosphatase inhibitors. Bioorg Med Chem 17:2658-72 (2009)  
Target
Name:
Low molecular weight phosphotyrosine protein phosphatase
Synonyms:
3.1.3.2 ACP1 LMW-PTP LMWPTP PPAC_HUMAN low molecular weight phosphotyrosine protein phosphatase isoform c
Type:
Mol. Mass.:
18042.81
Organism:
Homo sapiens (Human)
Description:
P24666
Residue:
158
  
Inhibitor
Name:
BDBM50257294
Synonyms:
7-Hydroxy-2-(4'-hydroxyphenyl)-3-[(1,1'-biphenyl-4-yl)methyl]-4H-1-benzopyran-4-one | CHEMBL492717
Type:
Small organic molecule
Emp. Form.:
C28H20O4
Mol. Mass.:
420.456
SMILES:
Oc1ccc(cc1)-c1oc2cc(O)ccc2c(=O)c1Cc1ccc(cc1)-c1ccccc1
: